BDBM47414 2-(4-bromanyl-2,5-dimethyl-phenyl)sulfanyl-N'-[(Z)-(3-oxidanyl-4-oxidanylidene-cyclohexa-2,5-dien-1-ylidene)methyl]ethanehydrazide::2-(4-bromo-2,5-dimethylphenyl)sulfanyl-N'-[(Z)-(3-hydroxy-4-oxocyclohexa-2,5-dien-1-ylidene)methyl]acetohydrazide::2-[(4-bromo-2,5-dimethyl-phenyl)thio]-N'-[(Z)-(3-hydroxy-4-keto-cyclohexa-2,5-dien-1-ylidene)methyl]acetohydrazide::2-[(4-bromo-2,5-dimethylphenyl)thio]-N'-[(Z)-(3-hydroxy-4-oxo-1-cyclohexa-2,5-dienylidene)methyl]acetohydrazide::MLS000570066::SMR000150086::cid_9552029
SMILES Cc1cc(SCC(=O)NN=Cc2ccc(O)c(O)c2)c(C)cc1Br
InChI Key InChIKey=WKTNKPAFSYJGSF-UHFFFAOYSA-N
Data  1 IC50  1 EC50
  Tab Delimited (TSV)   2D SDfile   Computed 3D by Vconf -m prep SDfile
Find this compound or compounds like it in BindingDB:
Activity Spreadsheet -- Enzyme Inhibition Constant Data from BindingDB
Found 2 hits for monomerid = 47414
TargetHeat shock factor protein 1(Mus musculus)
Broad Institute
Curated by PubChem BioAssay
LigandPNGBDBM47414(2-(4-bromanyl-2,5-dimethyl-phenyl)sulfanyl-N'-[(Z)...)
Affinity DataEC50: >2.60E+5nM. Assay description: Keywords: Heat Shock Factor-1 (HSF-1), Stress Response, MG132, NIH3T3, Luminescence Assay Overview: Confirmation testing of small molecules identifie...
In DepthDetails PCBioAssay
TargetTyrosine-protein kinase JAK2(Homo sapiens (Human))
The Scripps Research Institute Molecular Screening Center
Curated by PubChem BioAssay
LigandPNGBDBM47414(2-(4-bromanyl-2,5-dimethyl-phenyl)sulfanyl-N'-[(Z)...)
Affinity DataIC50:  1.07E+4nM. Assay description: Source (MLPCN Center Name): The Scripps Research Institute Molecular Screening Center (SRIMSC) Center Affiliation: The Scripps Research Institute (TS...
In DepthDetails PCBioAssay