BDBM474341 6-(bis(3-fluorophenyl)methyl)-11-hydroxy- 5,6-dihydro-10H- imidazo[2',1':3,4]pyrazino[1,2-b]pyridazin-10- one::US10858366, Example 2::US11453677, Example 2
SMILES Oc1c2-c3nccn3CC(C(c3cccc(F)c3)c3cccc(F)c3)n2ncc1=O
InChI Key InChIKey=LQVPPYWQWNAIED-UHFFFAOYSA-N
Data  2 IC50
  Tab Delimited (TSV)   2D SDfile   Computed 3D by Vconf -m prep SDfile
Find this compound or compounds like it in BindingDB:
Activity Spreadsheet -- Enzyme Inhibition Constant Data from BindingDB
Found 2 hits for monomerid = 474341
TargetPolymerase acidic protein()
Novartis
US Patent
LigandPNGBDBM474341(6-(bis(3-fluorophenyl)methyl)-11-hydroxy- 5,6-dihy...)
Affinity DataIC50:  70nM. Assay description: Compounds were dissolved and serially diluted in 100% DMSO then 0.5 μl was transferred to 384-well plates. 50 nM truncated Influenza A/victoria/...
Ligand InfoPC cidPC sid
In DepthDetails US Patent
TargetPolymerase acidic protein()
Novartis
US Patent
LigandPNGBDBM474341(6-(bis(3-fluorophenyl)methyl)-11-hydroxy- 5,6-dihy...)
Affinity DataIC50:  70nM. Assay description: Compounds were dissolved and serially diluted in 100% DMSO then 0.5 μl was transferred to 384-well plates. 50 nM truncated Influenza A/victoria/...
Ligand InfoPC cidPC sid
In DepthDetails US Patent