BDBM474385 US10858368, Entry 5::US11319327, Entry 5
SMILES CNC(=O)N1CCC2(CC(CCN3CCN(CC3)c3ccc(C)cc3)OC2=O)CC1
InChI Key InChIKey=KXRIRKPVAAHACV-UHFFFAOYSA-N
Data  2 IC50
  Tab Delimited (TSV)   2D SDfile   Computed 3D by Vconf -m prep SDfile
Find this compound or compounds like it in BindingDB:
Activity Spreadsheet -- Enzyme Inhibition Constant Data from BindingDB
Found 2 hits for monomerid = 474385
Target5-hydroxytryptamine receptor 7(Homo sapiens (Human))
Temple University
US Patent
LigandPNGBDBM474385(US10858368, Entry 5 | US11319327, Entry 5)
Affinity DataIC50:  102nM. Assay description: A stock concentration of 5 nM [3H]LSD (lysergic acid diethyl amide) is prepared in 50 mM Tris-HCl, 10 mM MgCl2, 1 mM EDTA, pH 7.4 (Assay Buffer). Ali...
Ligand InfoPC cidPC sid
In DepthDetails US Patent
Target5-hydroxytryptamine receptor 7(Homo sapiens (Human))
Temple University
US Patent
LigandPNGBDBM474385(US10858368, Entry 5 | US11319327, Entry 5)
Affinity DataIC50:  102nM. Assay description: A solution of the compound of the disclosure to be tested is prepared as a 1-mg/ml stock in Assay Buffer or DMSO according to its solubility. A simil...
Ligand InfoPC cidPC sid
In DepthDetails US Patent