BDBM474431 US10858373, Example 29
SMILES O=C(ON1C(=O)CCC1=O)N1CCC2(CC1)CN(CCO2)S(=O)(=O)CC1CCCCO1
InChI Key InChIKey=HYSJZQRPZCWWLD-UHFFFAOYSA-N
Data  2 IC50
  Tab Delimited (TSV)   2D SDfile   Computed 3D by Vconf -m prep SDfile
Find this compound or compounds like it in BindingDB:
Activity Spreadsheet -- Enzyme Inhibition Constant Data from BindingDB
Found 2 hits for monomerid = 474431
TargetMonoglyceride lipase(Homo sapiens (Human))
Pfizer
US Patent
LigandPNGBDBM474431(US10858373, Example 29)
Affinity DataIC50:  73.6nM. Assay description: T = 30 minutes.
Ligand InfoPC cidPC sid
In DepthDetails US Patent
TargetMonoglyceride lipase(Homo sapiens (Human))
Pfizer
US Patent
LigandPNGBDBM474431(US10858373, Example 29)
Affinity DataIC50:  264nM. Assay description: Assessment of MAGL inhibition utilizes human recombinant Monoacylglycerol Lipase and the fluorogenic substrate 7-hydroxycoumarinyl arachidonate (7-HC...
Ligand InfoPC cidPC sid
In DepthDetails US Patent