BDBM474448 US10858373, Example 46
SMILES CN(C1COC2(C1)CCN(CC2)C(=O)ON1C(=O)CCC1=O)S(=O)(=O)CC1CCC1
InChI Key InChIKey=RMUQUMQSJZQSLJ-UHFFFAOYSA-N
Data  2 IC50
  Tab Delimited (TSV)   2D SDfile   Computed 3D by Vconf -m prep SDfile
Find this compound or compounds like it in BindingDB:
Activity Spreadsheet -- Enzyme Inhibition Constant Data from BindingDB
Found 2 hits for monomerid = 474448
TargetMonoglyceride lipase(Homo sapiens (Human))
Pfizer
US Patent
LigandPNGBDBM474448(US10858373, Example 46)
Affinity DataIC50:  50.7nM. Assay description: T = 30 minutes.
Ligand InfoPC cidPC sid
In DepthDetails US Patent
TargetMonoglyceride lipase(Homo sapiens (Human))
Pfizer
US Patent
LigandPNGBDBM474448(US10858373, Example 46)
Affinity DataIC50:  514nM. Assay description: Assessment of MAGL inhibition utilizes human recombinant Monoacylglycerol Lipase and the fluorogenic substrate 7-hydroxycoumarinyl arachidonate (7-HC...
Ligand InfoPC cidPC sid
In DepthDetails US Patent