BDBM474497 N-(4-(2-bromo-3-phenylbenzyloxy)-5-chloro-2-(N-methoxy-N-methylcarbamoyl methoxy)benzyl)serine::US10882833, Example 12
SMILES CON(C)C(=O)COc1cc(OCc2cccc(c2Br)-c2ccccc2)c(Cl)cc1CN[C@@H](CO)C(O)=O
InChI Key InChIKey=APWAXKHNYLJJNC-QFIPXVFZSA-N
Data  1 IC50
  Tab Delimited (TSV)   2D SDfile   Computed 3D by Vconf -m prep SDfile
Find this compound or compounds like it in BindingDB:
Activity Spreadsheet -- Enzyme Inhibition Constant Data from BindingDB
Found 1 hit for monomerid = 474497
TargetProgrammed cell death 1 ligand/protein 1(Homo sapiens)
Institute Of Materia Medica, Chinese Academy Of Medical Sciences
US Patent
LigandPNGBDBM474497(N-(4-(2-bromo-3-phenylbenzyloxy)-5-chloro-2-(N-met...)
Affinity DataIC50:  191nM. Assay description: 1. In vitro activity evaluation: Cisbio PD-1/PD-L1 binding assay kit was applied for the detection method of in vitro enzymology level.Screening Prin...
Ligand InfoPC cidPC sid
In DepthDetails US Patent