BDBM474738 US10849883, Compound 165c::US11559515, Compound 165c
SMILES CC(=O)c1cn(CC(=O)N(CC(=O)NCc2cccc(Cl)c2F)C2CC2)c2ccc(cc12)C(=O)NCc1ccccn1
InChI Key InChIKey=FZRHGIGDVQTGKU-UHFFFAOYSA-N
Data  2 IC50
  Tab Delimited (TSV)   2D SDfile   Computed 3D by Vconf -m prep SDfile
Find this compound or compounds like it in BindingDB:
Activity Spreadsheet -- Enzyme Inhibition Constant Data from BindingDB
Found 2 hits for monomerid = 474738
TargetComplement factor D(Homo sapiens (Human))
Biocryst Pharmaceuticals
US Patent
LigandPNGBDBM474738(US10849883, Compound 165c | US11559515, Compound 1...)
Affinity DataIC50: >1.00E+4nM. Assay description: An established esterolytic assay for the measurement of Factor D activity and inhibition of Factor D activity was used (Kam, C. M.; McRae, B. J.; Har...
Ligand InfoPC cidPC sid
In DepthDetails US Patent
TargetComplement factor D(Homo sapiens (Human))
Biocryst Pharmaceuticals
US Patent
LigandPNGBDBM474738(US10849883, Compound 165c | US11559515, Compound 1...)
Affinity DataIC50: <1.00E+3nM. Assay description: An established esterolytic assay for the measurement of Factor D activity and inhibition of Factor D activity was used (Kam, C. M.; McRae, B. J.; Har...
Ligand InfoPC cidPC sid
In DepthDetails US Patent