BDBM474960 US10849901, Compound 10
SMILES [O-][N+](=O)c1ccc(cc1)-c1[nH]c2c(c(nn2c(=O)c1Cl)C(F)(F)F)-c1ccc(Cl)cc1
InChI Key InChIKey=VARXOYNPYITUGK-UHFFFAOYSA-N
Data  1 IC50
  Tab Delimited (TSV)   2D SDfile   Computed 3D by Vconf -m prep SDfile
Find this compound or compounds like it in BindingDB:
Activity Spreadsheet -- Enzyme Inhibition Constant Data from BindingDB
Found 1 hit for monomerid = 474960
TargetADP-ribosylation factor 6(Human)
Navigen
US Patent
LigandPNGBDBM474960(US10849901, Compound 10)
Affinity DataIC50:  0.880nM. Assay description: The primary biochemical assay uses a fluorometric assay for monitoring the replacement of bound nucleotide with a fluorogenic GTP derivative bearing ...
Ligand InfoPC cidPC sid
In DepthDetails US Patent