BDBM474969 US10849901, Compound 19
SMILES CN(C)c1ccc(cn1)-c1cccc(c1)-c1cc(=O)n2nc(c(-c3ccc(Cl)cc3)c2[nH]1)C(F)(F)F
InChI Key InChIKey=RQPIQVOMXMSEEG-UHFFFAOYSA-N
Data  1 IC50
  Tab Delimited (TSV)   2D SDfile   Computed 3D by Vconf -m prep SDfile
Find this compound or compounds like it in BindingDB:
Activity Spreadsheet -- Enzyme Inhibition Constant Data from BindingDB
Found 1 hit for monomerid = 474969
TargetADP-ribosylation factor 6(Human)
Navigen
US Patent
LigandPNGBDBM474969(US10849901, Compound 19)
Affinity DataIC50:  1.10nM. Assay description: The primary biochemical assay uses a fluorometric assay for monitoring the replacement of bound nucleotide with a fluorogenic GTP derivative bearing ...
Ligand InfoPC cidPC sid
In DepthDetails US Patent