BDBM474976 US10849901, Compound 26
SMILES COc1cc(ccc1Cl)-c1c(C)nn2c1[nH]c(cc2=O)-c1ccc(cc1)[N+]([O-])=O
InChI Key InChIKey=RBVJQFHNFLEPGE-UHFFFAOYSA-N
Data  1 IC50
  Tab Delimited (TSV)   2D SDfile   Computed 3D by Vconf -m prep SDfile
Find this compound or compounds like it in BindingDB:
Activity Spreadsheet -- Enzyme Inhibition Constant Data from BindingDB
Found 1 hit for monomerid = 474976
TargetADP-ribosylation factor 6(Human)
Navigen
US Patent
LigandPNGBDBM474976(US10849901, Compound 26)
Affinity DataIC50:  1.40nM. Assay description: The primary biochemical assay uses a fluorometric assay for monitoring the replacement of bound nucleotide with a fluorogenic GTP derivative bearing ...
Ligand InfoPC cidPC sid
In DepthDetails US Patent