BDBM474984 US10849901, Compound 34
SMILES FC(F)(F)c1nn2c([nH]c(cc2=O)-c2cccc(Br)c2)c1-c1ccc(Cl)cc1
InChI Key InChIKey=MGJOHVAWNAESCR-UHFFFAOYSA-N
Data  1 IC50
  Tab Delimited (TSV)   2D SDfile   Computed 3D by Vconf -m prep SDfile
Find this compound or compounds like it in BindingDB:
Activity Spreadsheet -- Enzyme Inhibition Constant Data from BindingDB
Found 1 hit for monomerid = 474984
TargetADP-ribosylation factor 6(Human)
Navigen
US Patent
LigandPNGBDBM474984(US10849901, Compound 34)
Affinity DataIC50:  1.60nM. Assay description: The primary biochemical assay uses a fluorometric assay for monitoring the replacement of bound nucleotide with a fluorogenic GTP derivative bearing ...
Ligand InfoPC cidPC sid
In DepthDetails US Patent