BDBM474992 US10849901, Compound 42
SMILES Cc1nn2c([nH]c(cc2=O)-c2ccc(NC(=O)NCc3ccccc3)cc2)c1-c1ccc(Cl)cc1
InChI Key InChIKey=RXGOWVKVRRHAND-UHFFFAOYSA-N
Data  1 IC50
  Tab Delimited (TSV)   2D SDfile   Computed 3D by Vconf -m prep SDfile
Find this compound or compounds like it in BindingDB:
Activity Spreadsheet -- Enzyme Inhibition Constant Data from BindingDB
Found 1 hit for monomerid = 474992
TargetADP-ribosylation factor 6(Human)
Navigen
US Patent
LigandPNGBDBM474992(US10849901, Compound 42)
Affinity DataIC50:  2.10nM. Assay description: The primary biochemical assay uses a fluorometric assay for monitoring the replacement of bound nucleotide with a fluorogenic GTP derivative bearing ...
Ligand InfoPC cidPC sid
In DepthDetails US Patent