BDBM475007 US10849901, Compound 57
SMILES Cc1nn2c([nH]c(cc2=O)-c2ccc(cc2)[N+]([O-])=O)c1-c1cccc(Cl)c1Cl
InChI Key InChIKey=XRMDPQARLZDWFO-UHFFFAOYSA-N
Data  1 IC50
  Tab Delimited (TSV)   2D SDfile   Computed 3D by Vconf -m prep SDfile
Find this compound or compounds like it in BindingDB:
Activity Spreadsheet -- Enzyme Inhibition Constant Data from BindingDB
Found 1 hit for monomerid = 475007
TargetADP-ribosylation factor 6(Human)
Navigen
US Patent
LigandPNGBDBM475007(US10849901, Compound 57)
Affinity DataIC50:  3.20nM. Assay description: The primary biochemical assay uses a fluorometric assay for monitoring the replacement of bound nucleotide with a fluorogenic GTP derivative bearing ...
Ligand InfoPC cidPC sid
In DepthDetails US Patent