BDBM475069 US10849901, Compound 119
SMILES Oc1c(Br)cc(Cl)cc1C(=O)Nc1cc(Cl)c(c(Cl)c1)-c1cccc2cccnc12
InChI Key InChIKey=SJUTWADCYWBVPP-UHFFFAOYSA-N
Data  1 IC50
  Tab Delimited (TSV)   2D SDfile   Computed 3D by Vconf -m prep SDfile
Find this compound or compounds like it in BindingDB:
Activity Spreadsheet -- Enzyme Inhibition Constant Data from BindingDB
Found 1 hit for monomerid = 475069
TargetADP-ribosylation factor 6(Human)
Navigen
US Patent
LigandPNGBDBM475069(US10849901, Compound 119)
Affinity DataIC50:  2.10nM. Assay description: The primary biochemical assay uses a fluorometric assay for monitoring the replacement of bound nucleotide with a fluorogenic GTP derivative bearing ...
Ligand InfoPC cidPC sid
In DepthDetails US Patent