BDBM475414 1-(5-Bromo-6,7-dimethyl-1H-benzoimidazol-2-yl)-1H-::US10851083, Example 26::US11618744, Example 26
SMILES Cc1c(Br)cc2nc([nH]c2c1C)-n1cc(cn1)C(O)=O
InChI Key InChIKey=KURVVPBGVUWXEB-UHFFFAOYSA-N
Data  2 IC50
  Tab Delimited (TSV)   2D SDfile   Computed 3D by Vconf -m prep SDfile
Find this compound or compounds like it in BindingDB:
Activity Spreadsheet -- Enzyme Inhibition Constant Data from BindingDB
Found 2 hits for monomerid = 475414
TargetEgl nine homolog 1 [181-417](Homo sapiens (Human))
Janssen Pharmaceutica
US Patent
LigandPNGBDBM475414(1-(5-Bromo-6,7-dimethyl-1H-benzoimidazol-2-yl)-1H-...)
Affinity DataIC50:  398nM. Assay description: The PHD2 181-417 polypeptide (3 μg) was pre-incubated for 30 minutes with test compound prior to assessing the enzymatic activity of the polypep...
Ligand InfoPC cidPC sid
In DepthDetails US Patent
TargetEgl nine homolog 1 [181-417](Homo sapiens (Human))
Janssen Pharmaceutica
US Patent
LigandPNGBDBM475414(1-(5-Bromo-6,7-dimethyl-1H-benzoimidazol-2-yl)-1H-...)
Affinity DataIC50:  398nM. Assay description: The PHD2181-417 polypeptide (3 μg) was pre-incubated for 30 minutes with test compound prior to assessing the enzymatic activity of the polypept...
Ligand InfoPC cidPC sid
In DepthDetails US Patent