BDBM475434 1-(6-Chloro-5-methoxy-1H-benzoimidazol-2-yl)-1H-::US10851083, Example 46::US11618744, Example 46
SMILES COc1cc2[nH]c(nc2cc1Cl)-n1cc(cn1)C(O)=O
InChI Key InChIKey=FEXAJBGZDJLQBO-UHFFFAOYSA-N
Data  2 IC50
  Tab Delimited (TSV)   2D SDfile   Computed 3D by Vconf -m prep SDfile
Find this compound or compounds like it in BindingDB:
Activity Spreadsheet -- Enzyme Inhibition Constant Data from BindingDB
Found 2 hits for monomerid = 475434
TargetEgl nine homolog 1 [181-417](Homo sapiens (Human))
Janssen Pharmaceutica
US Patent
LigandPNGBDBM475434(1-(6-Chloro-5-methoxy-1H-benzoimidazol-2-yl)-1H- |...)
Affinity DataIC50:  316nM. Assay description: The PHD2 181-417 polypeptide (3 μg) was pre-incubated for 30 minutes with test compound prior to assessing the enzymatic activity of the polypep...
Ligand InfoPC cidPC sid
In DepthDetails US Patent
TargetEgl nine homolog 1 [181-417](Homo sapiens (Human))
Janssen Pharmaceutica
US Patent
LigandPNGBDBM475434(1-(6-Chloro-5-methoxy-1H-benzoimidazol-2-yl)-1H- |...)
Affinity DataIC50:  316nM. Assay description: The PHD2181-417 polypeptide (3 μg) was pre-incubated for 30 minutes with test compound prior to assessing the enzymatic activity of the polypept...
Ligand InfoPC cidPC sid
In DepthDetails US Patent