BDBM475474 1-[6-Chloro-5-(4-trifluoromethoxy-benzenesulfonyl)-1H-::US10851083, Example 86::US11618744, Example 86
SMILES OC(=O)c1cnn(c1)-c1nc2cc(c(Cl)cc2[nH]1)S(=O)(=O)c1ccc(OC(F)(F)F)cc1
InChI Key InChIKey=JMVOEXZKWJTVQP-UHFFFAOYSA-N
Data  2 IC50
  Tab Delimited (TSV)   2D SDfile   Computed 3D by Vconf -m prep SDfile
Find this compound or compounds like it in BindingDB:
Activity Spreadsheet -- Enzyme Inhibition Constant Data from BindingDB
Found 2 hits for monomerid = 475474
TargetEgl nine homolog 1 [181-417](Homo sapiens (Human))
Janssen Pharmaceutica
US Patent
LigandPNGBDBM475474(1-[6-Chloro-5-(4-trifluoromethoxy-benzenesulfonyl)...)
Affinity DataIC50:  50.1nM. Assay description: The PHD2 181-417 polypeptide (3 μg) was pre-incubated for 30 minutes with test compound prior to assessing the enzymatic activity of the polypep...
Ligand InfoPC cidPC sid
In DepthDetails US Patent
TargetEgl nine homolog 1 [181-417](Homo sapiens (Human))
Janssen Pharmaceutica
US Patent
LigandPNGBDBM475474(1-[6-Chloro-5-(4-trifluoromethoxy-benzenesulfonyl)...)
Affinity DataIC50:  50.1nM. Assay description: The PHD2181-417 polypeptide (3 μg) was pre-incubated for 30 minutes with test compound prior to assessing the enzymatic activity of the polypept...
Ligand InfoPC cidPC sid
In DepthDetails US Patent