BDBM475532 1-{6-Chloro-5[2-(4-methyl-piperazin-1-yl)-acetylamino]-::US10851083, Example 144::US11618744, Example 144
SMILES CN1CCN(CC(=O)Nc2cc3nc([nH]c3cc2Cl)-n2cc(cn2)C(O)=O)CC1
InChI Key InChIKey=LQGMXGWFFPDBSD-UHFFFAOYSA-N
Data  2 IC50
  Tab Delimited (TSV)   2D SDfile   Computed 3D by Vconf -m prep SDfile
Find this compound or compounds like it in BindingDB:
Activity Spreadsheet -- Enzyme Inhibition Constant Data from BindingDB
Found 2 hits for monomerid = 475532
TargetEgl nine homolog 1 [181-417](Homo sapiens (Human))
Janssen Pharmaceutica
US Patent
LigandPNGBDBM475532(1-{6-Chloro-5[2-(4-methyl-piperazin-1-yl)-acetylam...)
Affinity DataIC50:  398nM. Assay description: The PHD2 181-417 polypeptide (3 μg) was pre-incubated for 30 minutes with test compound prior to assessing the enzymatic activity of the polypep...
Ligand InfoPC cidPC sid
In DepthDetails US Patent
TargetEgl nine homolog 1 [181-417](Homo sapiens (Human))
Janssen Pharmaceutica
US Patent
LigandPNGBDBM475532(1-{6-Chloro-5[2-(4-methyl-piperazin-1-yl)-acetylam...)
Affinity DataIC50:  398nM. Assay description: The PHD2181-417 polypeptide (3 μg) was pre-incubated for 30 minutes with test compound prior to assessing the enzymatic activity of the polypept...
Ligand InfoPC cidPC sid
In DepthDetails US Patent