BDBM475571 1-(6,7-Dichloro-1H-imidazo[4,5-b]quinoxalin-2-yl)-1H-::US10851083, Example 183::US11618744, Example 183
SMILES OC(=O)c1cnn(c1)-c1nc2nc3cc(Cl)c(Cl)cc3nc2[nH]1
InChI Key InChIKey=CPZAKLJLASPJHU-UHFFFAOYSA-N
Data  2 IC50
  Tab Delimited (TSV)   2D SDfile   Computed 3D by Vconf -m prep SDfile
Find this compound or compounds like it in BindingDB:
Activity Spreadsheet -- Enzyme Inhibition Constant Data from BindingDB
Found 2 hits for monomerid = 475571
TargetEgl nine homolog 1 [181-417](Homo sapiens (Human))
Janssen Pharmaceutica
US Patent
LigandPNGBDBM475571(1-(6,7-Dichloro-1H-imidazo[4,5-b]quinoxalin-2-yl)-...)
Affinity DataIC50:  398nM. Assay description: The PHD2 181-417 polypeptide (3 μg) was pre-incubated for 30 minutes with test compound prior to assessing the enzymatic activity of the polypep...
Ligand InfoPC cidPC sid
In DepthDetails US Patent
TargetEgl nine homolog 1 [181-417](Homo sapiens (Human))
Janssen Pharmaceutica
US Patent
LigandPNGBDBM475571(1-(6,7-Dichloro-1H-imidazo[4,5-b]quinoxalin-2-yl)-...)
Affinity DataIC50:  398nM. Assay description: The PHD2181-417 polypeptide (3 μg) was pre-incubated for 30 minutes with test compound prior to assessing the enzymatic activity of the polypept...
Ligand InfoPC cidPC sid
In DepthDetails US Patent