BDBM475597 US10851089, Compound FC-28
SMILES Cc1cc(Sc2ccc(OCc3cccc(C)c3)cc2)c(o1)C1NC(=O)NC1=O
InChI Key InChIKey=ZLZCXSDLSAEWNP-UHFFFAOYSA-N
Data  1 IC50
  Tab Delimited (TSV)   2D SDfile   Computed 3D by Vconf -m prep SDfile
Find this compound or compounds like it in BindingDB:
Activity Spreadsheet -- Enzyme Inhibition Constant Data from BindingDB
Found 1 hit for monomerid = 475597
TargetMacrophage metalloelastase(Homo sapiens (Human))
Foresee Pharmaceuticals
US Patent
LigandPNGBDBM475597(US10851089, Compound FC-28)
Affinity DataIC50:  2.75E+3nM. Assay description: The inhibitory effect of compounds on the rate of cleaving fluorogenic MMP substrate (Enzo, BML-P128) by recombinant human MMP-12 catalytic domain (E...
Ligand InfoPC cidPC sid
In DepthDetails US Patent