BDBM47573 (5Z)-5-(2,5-dimethoxy-4-pyrrolidino-benzylidene)-3-(2-methoxyethyl)-2-phenylimino-thiazolidin-4-one::(5Z)-5-[(2,5-dimethoxy-4-pyrrolidin-1-yl-phenyl)methylidene]-3-(2-methoxyethyl)-2-phenylimino-1,3-thiazolidin-4-one::(5Z)-5-[(2,5-dimethoxy-4-pyrrolidin-1-ylphenyl)methylidene]-3-(2-methoxyethyl)-2-phenylimino-1,3-thiazolidin-4-one::(5Z)-5-[[2,5-dimethoxy-4-(1-pyrrolidinyl)phenyl]methylidene]-3-(2-methoxyethyl)-2-phenylimino-4-thiazolidinone::5-[2,5-dimethoxy-4-(1-pyrrolidinyl)benzylidene]-3-(2-methoxyethyl)-2-(phenylimino)-1,3-thiazolidin-4-one::MLS000545147::SMR000160826::cid_11839287
SMILES COCCN1C(=O)\C(S\C1=N\c1ccccc1)=C\c1cc(OC)c(cc1OC)N1CCCC1
InChI Key InChIKey=BFRHBTLZVUBPJK-IVCURSBOSA-N
Data  1 IC50  1 EC50
  Tab Delimited (TSV)   2D SDfile   Computed 3D by Vconf -m prep SDfile
Find this compound or compounds like it in BindingDB:
Activity Spreadsheet -- Enzyme Inhibition Constant Data from BindingDB
Found 2 hits for monomerid = 47573
TargetGlycoprotein 42(Human herpesvirus 4 type 2)
Emory University
Curated by PubChem BioAssay
LigandPNGBDBM47573((5Z)-5-(2,5-dimethoxy-4-pyrrolidino-benzylidene)-3...)
Affinity DataIC50:  1.04E+4nM. Assay description: NIH Molecular Libraries Screening Centers Network [MLSCN] Emory Chemical Biology Discovery Center in MLSCN Assay provider: Theodore Jardetzky; Northw...
In DepthDetails PCBioAssay
TargetGlutathione S-transferase Mu 1(Homo sapiens (Human))
Nmmlsc
Curated by PubChem BioAssay
LigandPNGBDBM47573((5Z)-5-(2,5-dimethoxy-4-pyrrolidino-benzylidene)-3...)
Affinity DataEC50:  1.39E+3nM. Assay description: University of New Mexico Assay Overview: Assay Support: NIH I RO3 MH081231-01 HTS to identify specific small molecule inhibitors of Ras and Ras-re...
In DepthDetails PCBioAssay