BDBM47578 2-[(4-oxo-1-cyclohexa-2,5-dienylidene)methylhydrazo]-1H-quinazolin-4-one::2-[2-[(4-oxidanylidenecyclohexa-2,5-dien-1-ylidene)methyl]hydrazinyl]-1H-quinazolin-4-one::2-[2-[(4-oxocyclohexa-2,5-dien-1-ylidene)methyl]hydrazinyl]-1H-quinazolin-4-one::2-[N'-[(4-ketocyclohexa-2,5-dien-1-ylidene)methyl]hydrazino]-1H-quinazolin-4-one::4-hydroxybenzaldehyde (4-oxo-3,4-dihydro-2-quinazolinyl)hydrazone::MLS000571412::SMR000193497::cid_5344351
SMILES Oc1ccc(CN=Nc2nc3ccccc3c(=O)[nH]2)cc1
InChI Key InChIKey=HQFFRISNHSMYQZ-UHFFFAOYSA-N
Data  1 EC50
  Tab Delimited (TSV)   2D SDfile   Computed 3D by Vconf -m prep SDfile
Find this compound or compounds like it in BindingDB:
Activity Spreadsheet -- Enzyme Inhibition Constant Data from BindingDB
Found 1 hit for monomerid = 47578
TargetGlutathione S-transferase Mu 1(Homo sapiens (Human))
Nmmlsc
Curated by PubChem BioAssay
LigandPNGBDBM47578(2-[(4-oxo-1-cyclohexa-2,5-dienylidene)methylhydraz...)
Affinity DataEC50:  7.68E+3nM. Assay description: University of New Mexico Assay Overview: Assay Support: NIH I RO3 MH081231-01 HTS to identify specific small molecule inhibitors of Ras and Ras-re...
In DepthDetails PCBioAssay