BDBM47579 (4-{[4-(Benzyl-methanesulfonyl-amino)-benzoyl]-hydrazonomethyl}-phenoxy)-acetic acid methyl ester::2-[4-[[[4-[benzyl(mesyl)amino]benzoyl]hydrazono]methyl]phenoxy]acetic acid methyl ester::2-[4-[[[[4-[methylsulfonyl-(phenylmethyl)amino]phenyl]-oxomethyl]hydrazinylidene]methyl]phenoxy]acetic acid methyl ester::MLS000547654::SMR000171734::cid_1107786::methyl 2-[4-[[[4-[benzyl(methylsulfonyl)amino]benzoyl]hydrazinylidene]methyl]phenoxy]acetate::methyl 2-[4-[[[4-[methylsulfonyl-(phenylmethyl)amino]phenyl]carbonylhydrazinylidene]methyl]phenoxy]ethanoate
SMILES COC(=O)COc1ccc(C=NNC(=O)c2ccc(cc2)N(Cc2ccccc2)S(C)(=O)=O)cc1
InChI Key InChIKey=IVQSUBMJYVQUQK-UHFFFAOYSA-N
Data  1 IC50  1 EC50
  Tab Delimited (TSV)   2D SDfile   Computed 3D by Vconf -m prep SDfile
Find this compound or compounds like it in BindingDB:
Activity Spreadsheet -- Enzyme Inhibition Constant Data from BindingDB
Found 2 hits for monomerid = 47579
TargetNeutrophil cytosol factor 1 [S99G](Homo sapiens (Human))
Emory University
Curated by PubChem BioAssay
LigandPNGBDBM47579((4-{[4-(Benzyl-methanesulfonyl-amino)-benzoyl]-hyd...)
Affinity DataIC50:  5.00E+4nM. Assay description: NIH Molecular Libraries Screening Centers Network [MLSCN] Emory Chemical Biology Discovery Center in MLSCN Assay provider: Susan Smith, Emory Univers...
In DepthDetails PCBioAssay
TargetGlutathione S-transferase Mu 1(Homo sapiens (Human))
Nmmlsc
Curated by PubChem BioAssay
LigandPNGBDBM47579((4-{[4-(Benzyl-methanesulfonyl-amino)-benzoyl]-hyd...)
Affinity DataEC50:  4.09E+3nM. Assay description: University of New Mexico Assay Overview: Assay Support: NIH I RO3 MH081231-01 HTS to identify specific small molecule inhibitors of Ras and Ras-re...
In DepthDetails PCBioAssay