BDBM47584 (E)-2-(4-bromobenzoyl)-3-[4-(diethylamino)phenyl]acrylonitrile::(E)-2-(4-bromobenzoyl)-3-[4-(diethylamino)phenyl]prop-2-enenitrile::(E)-2-(4-bromophenyl)carbonyl-3-[4-(diethylamino)phenyl]prop-2-enenitrile::(E)-2-[(4-bromophenyl)-oxomethyl]-3-[4-(diethylamino)phenyl]-2-propenenitrile::MLS000576501::SMR000185885::cid_5333607
SMILES CCN(CC)c1ccc(\C=C(/C#N)C(=O)c2ccc(Br)cc2)cc1
InChI Key InChIKey=PYMMTFMRJFLXGP-GHRIWEEISA-N
Data  1 IC50  1 EC50
  Tab Delimited (TSV)   2D SDfile   Computed 3D by Vconf -m prep SDfile
Find this compound or compounds like it in BindingDB:
Activity Spreadsheet -- Enzyme Inhibition Constant Data from BindingDB
Found 2 hits for monomerid = 47584
TargetGlycoprotein 42(Human herpesvirus 4 type 2)
Emory University
Curated by PubChem BioAssay
LigandPNGBDBM47584((E)-2-(4-bromobenzoyl)-3-[4-(diethylamino)phenyl]a...)
Affinity DataIC50:  3.87E+3nM. Assay description: NIH Molecular Libraries Screening Centers Network [MLSCN] Emory Chemical Biology Discovery Center in MLSCN Assay provider: Theodore Jardetzky; Northw...
In DepthDetails PCBioAssay
TargetGlutathione S-transferase Mu 1(Homo sapiens (Human))
Nmmlsc
Curated by PubChem BioAssay
LigandPNGBDBM47584((E)-2-(4-bromobenzoyl)-3-[4-(diethylamino)phenyl]a...)
Affinity DataEC50:  1.11E+4nM. Assay description: University of New Mexico Assay Overview: Assay Support: NIH I RO3 MH081231-01 HTS to identify specific small molecule inhibitors of Ras and Ras-re...
In DepthDetails PCBioAssay