BDBM475870 US10864201, Ex. 7.2
SMILES CN([C@H]1CCN(C1)C(=O)c1cnc2N[C@](C)(Cc2c1)c1cccc(Cl)c1)C(C)=O
InChI Key InChIKey=CNAMVQSJUCNMCA-SIKLNZKXSA-N
Data  1 IC50
  Tab Delimited (TSV)   2D SDfile   Computed 3D by Vconf -m prep SDfile
Find this compound or compounds like it in BindingDB:
Activity Spreadsheet -- Enzyme Inhibition Constant Data from BindingDB
Found 1 hit for monomerid = 475870
TargetPantetheinase(Homo sapiens (Human))
Boehringer Ingelheim International
US Patent
LigandPNGBDBM475870(US10864201, Ex. 7.2)
Affinity DataIC50:  0.100nM. Assay description: The test compounds are dissolved in 100% DMSO at a concentration of 10 mM and in a first step diluted in DMSO to a concentration of 5 mM, followed by...
Ligand InfoPC cidPC sid
In DepthDetails US Patent