BDBM47588 2-(4-Phenyl-thiazol-2-yl)-benzo[f]chromen-3-ylideneamine::2-(4-phenyl-1,3-thiazol-2-yl)benzo[f]chromen-3-imine::2-(4-phenyl-2-thiazolyl)-3-benzo[f][1]benzopyranimine::MLS000589984::SMR000217159::[2-(4-phenylthiazol-2-yl)benzo[f]chromen-3-ylidene]amine::cid_1888321
SMILES N=c1oc2ccc3ccccc3c2cc1-c1nc(cs1)-c1ccccc1
InChI Key InChIKey=XQGMMBVYBUPQID-UHFFFAOYSA-N
Data  1 IC50  1 EC50
  Tab Delimited (TSV)   2D SDfile   Computed 3D by Vconf -m prep SDfile
Find this compound or compounds like it in BindingDB:
Activity Spreadsheet -- Enzyme Inhibition Constant Data from BindingDB
Found 2 hits for monomerid = 47588
TargetGlycoprotein 42(Human herpesvirus 4 type 2)
Emory University
Curated by PubChem BioAssay
LigandPNGBDBM47588(2-(4-Phenyl-thiazol-2-yl)-benzo[f]chromen-3-yliden...)
Affinity DataIC50:  1.88E+3nM. Assay description: NIH Molecular Libraries Screening Centers Network [MLSCN] Emory Chemical Biology Discovery Center in MLSCN Assay provider: Theodore Jardetzky; Northw...
In DepthDetails PCBioAssay
TargetGlutathione S-transferase Mu 1(Homo sapiens (Human))
Nmmlsc
Curated by PubChem BioAssay
LigandPNGBDBM47588(2-(4-Phenyl-thiazol-2-yl)-benzo[f]chromen-3-yliden...)
Affinity DataEC50:  1.40E+3nM. Assay description: University of New Mexico Assay Overview: Assay Support: NIH I RO3 MH081231-01 HTS to identify specific small molecule inhibitors of Ras and Ras-re...
In DepthDetails PCBioAssay