BDBM475896 US10864201, Ex. 11.9
SMILES CN([C@H]1CCN(C1)C(=O)c1cnc2NC(C)(C)CCc2c1)C(=O)C1CC1
InChI Key InChIKey=KZCYYXRRHKECFV-INIZCTEOSA-N
Data  1 IC50
  Tab Delimited (TSV)   2D SDfile   Computed 3D by Vconf -m prep SDfile
Find this compound or compounds like it in BindingDB:
Activity Spreadsheet -- Enzyme Inhibition Constant Data from BindingDB
Found 1 hit for monomerid = 475896
TargetPantetheinase(Homo sapiens (Human))
Boehringer Ingelheim International
US Patent
LigandPNGBDBM475896(US10864201, Ex. 11.9)
Affinity DataIC50:  0.700nM. Assay description: The test compounds are dissolved in 100% DMSO at a concentration of 10 mM and in a first step diluted in DMSO to a concentration of 5 mM, followed by...
Ligand InfoPC cidPC sid
In DepthDetails US Patent