BDBM475948 US10865206, Compound 110
SMILES Nc1ccc(cc1)C(=O)NC1CC(F)CC(C1)Nc1ncc(Cl)c(n1)-c1c[nH]c2ccccc12
InChI Key
Data  1 IC50
  Tab Delimited (TSV)   2D SDfile   Computed 3D by Vconf -m prep SDfile
Find this compound or compounds like it in BindingDB:
Activity Spreadsheet -- Enzyme Inhibition Constant Data from BindingDB
Found 1 hit for monomerid = 475948
TargetCyclin-dependent kinase 7(Homo sapiens (Human))
Syros Pharmaceuticals
US Patent
LigandPNGBDBM475948(US10865206, Compound 110)
Affinity DataIC50:  550nM. Assay description: Compounds of the invention were assayed for CDK7 activity at Life Technologies(Grand Island, N.Y.) using their commercially available AdaptaŽ kinase ...
Ligand InfoPC cidPC sid
In DepthDetails US Patent