BDBM47596 4-[2-[(5E)-5-(4-chlorobenzylidene)-4-keto-2-thioxo-thiazolidin-3-yl]ethyl]benzenesulfonamide::4-[2-[(5E)-5-[(4-chlorophenyl)methylidene]-4-oxidanylidene-2-sulfanylidene-1,3-thiazolidin-3-yl]ethyl]benzenesulfonamide::4-[2-[(5E)-5-[(4-chlorophenyl)methylidene]-4-oxo-2-sulfanylidene-1,3-thiazolidin-3-yl]ethyl]benzenesulfonamide::4-[2-[(5E)-5-[(4-chlorophenyl)methylidene]-4-oxo-2-sulfanylidene-3-thiazolidinyl]ethyl]benzenesulfonamide::MLS000697281::SMR000237984::cid_2141470
SMILES NS(=O)(=O)c1ccc(CCN2C(=S)S\C(=C\c3ccc(Cl)cc3)C2=O)cc1
InChI Key InChIKey=HBKQIISXGIQMKD-LFIBNONCSA-N
Data  1 EC50
  Tab Delimited (TSV)   2D SDfile   Computed 3D by Vconf -m prep SDfile
Find this compound or compounds like it in BindingDB:
Activity Spreadsheet -- Enzyme Inhibition Constant Data from BindingDB
Found 1 hit for monomerid = 47596
TargetGlutathione S-transferase Mu 1(Homo sapiens (Human))
Nmmlsc
Curated by PubChem BioAssay
LigandPNGBDBM47596(4-[2-[(5E)-5-(4-chlorobenzylidene)-4-keto-2-thioxo...)
Affinity DataEC50:  6.03E+3nM. Assay description: University of New Mexico Assay Overview: Assay Support: NIH I RO3 MH081231-01 HTS to identify specific small molecule inhibitors of Ras and Ras-re...
In DepthDetails PCBioAssay