BDBM476032 US10865208, Compound I-89::[(2R,3S,4R,5R)-5-{4-amino-3-[(4-methylphenyl)sulfanyl]-1H-pyrazolo[3,4- d]pyrimidin-1-yl}-3,4-dihydroxytetrahydrofuran-2-yl]methyl sulfamate
SMILES Cc1ccc(Sc2nn([C@@H]3O[C@H](COS(N)(=O)=O)[C@@H](O)[C@H]3O)c3ncnc(N)c23)cc1
InChI Key InChIKey=QJCZOZLJJUHSRJ-CNEMSGBDSA-N
Data  1 IC50
  Tab Delimited (TSV)   2D SDfile   Computed 3D by Vconf -m prep SDfile
Find this compound or compounds like it in BindingDB:
Activity Spreadsheet -- Enzyme Inhibition Constant Data from BindingDB
Found 1 hit for monomerid = 476032
TargetUbiquitin-like modifier-activating enzyme ATG7(Homo sapiens (Human))
Millennium Pharmaceuticals
US Patent
LigandPNGBDBM476032(US10865208, Compound I-89 | [(2R,3S,4R,5R)-5-{4-am...)
Affinity DataIC50: <20nM. Assay description: The total volume of the ATG7 enzymatic assay is 50 μL and contains 50 mM HEPES Hemisodium (pH 7.5), 0.05% BSA, 0.01% Tween-20, 25 mM NaCl, 5 mM ...
Ligand InfoPC cidPC sid
In DepthDetails US Patent