BDBM476033 US10865208, Compound I-90::[(2R,3S,4R,5R)-5-{4-amino-3-[(cyanomethyl)sulfanyl]-1H-pyrazolo[3,4- d]pyrimidin-1-yl}-3,4-dihydroxytetrahydrofuran-2-yl]methyl sulfamate
SMILES Nc1ncnc2n(nc(SCC#N)c12)[C@@H]1O[C@H](COS(N)(=O)=O)[C@@H](O)[C@H]1O
InChI Key InChIKey=OPSVFCQYPIERLA-JTFADIMSSA-N
Data  1 IC50
  Tab Delimited (TSV)   2D SDfile   Computed 3D by Vconf -m prep SDfile
Find this compound or compounds like it in BindingDB:
Activity Spreadsheet -- Enzyme Inhibition Constant Data from BindingDB
Found 1 hit for monomerid = 476033
TargetUbiquitin-like modifier-activating enzyme ATG7(Homo sapiens (Human))
Millennium Pharmaceuticals
US Patent
LigandPNGBDBM476033(US10865208, Compound I-90 | [(2R,3S,4R,5R)-5-{4-am...)
Affinity DataIC50:  35nM. Assay description: The total volume of the ATG7 enzymatic assay is 50 μL and contains 50 mM HEPES Hemisodium (pH 7.5), 0.05% BSA, 0.01% Tween-20, 25 mM NaCl, 5 mM ...
Ligand InfoPC cidPC sid
In DepthDetails US Patent