BDBM47608 (4E)-2-bromanyl-6-methoxy-4-[[(phenylmethyl)amino]-sulfanyl-methylidene]cyclohexa-2,5-dien-1-one::(4E)-2-bromo-4-[mercapto-[(phenylmethyl)amino]methylidene]-6-methoxy-1-cyclohexa-2,5-dienone::(4E)-4-[(benzylamino)-mercapto-methylene]-2-bromo-6-methoxy-cyclohexa-2,5-dien-1-one::(4E)-4-[(benzylamino)-sulfanylmethylidene]-2-bromo-6-methoxycyclohexa-2,5-dien-1-one::MLS000663203::N-benzyl-3-bromo-4-hydroxy-5-methoxybenzenecarbothioamide::SMR000301016::cid_6096903
SMILES COc1cc(cc(Br)c1O)C(=S)NCc1ccccc1
InChI Key InChIKey=JGLMABKLWHJZIR-UHFFFAOYSA-N
Data  1 EC50
  Tab Delimited (TSV)   2D SDfile   Computed 3D by Vconf -m prep SDfile
Find this compound or compounds like it in BindingDB:
Activity Spreadsheet -- Enzyme Inhibition Constant Data from BindingDB
Found 1 hit for monomerid = 47608
TargetGlutathione S-transferase Mu 1(Homo sapiens (Human))
Nmmlsc
Curated by PubChem BioAssay
LigandPNGBDBM47608((4E)-2-bromanyl-6-methoxy-4-[[(phenylmethyl)amino]...)
Affinity DataEC50:  5.37E+4nM. Assay description: University of New Mexico Assay Overview: Assay Support: NIH I RO3 MH081231-01 HTS to identify specific small molecule inhibitors of Ras and Ras-re...
In DepthDetails PCBioAssay