BDBM47614 MLS000693331::N-(3-hydroxyphenyl)-4-(2-phenylsulfanylethanoylamino)benzamide::N-(3-hydroxyphenyl)-4-[(2-phenylsulfanylacetyl)amino]benzamide::N-(3-hydroxyphenyl)-4-[[1-oxo-2-(phenylthio)ethyl]amino]benzamide::N-(3-hydroxyphenyl)-4-[[2-(phenylthio)acetyl]amino]benzamide::N-(3-hydroxyphenyl)-4-{[(phenylthio)acetyl]amino}benzamide::SMR000299858::cid_1287668
SMILES Oc1cccc(NC(=O)c2ccc(NC(=O)CSc3ccccc3)cc2)c1
InChI Key InChIKey=DQDGITNLMCACDI-UHFFFAOYSA-N
Data  1 EC50
  Tab Delimited (TSV)   2D SDfile   Computed 3D by Vconf -m prep SDfile
Find this compound or compounds like it in BindingDB:
Activity Spreadsheet -- Enzyme Inhibition Constant Data from BindingDB
Found 1 hit for monomerid = 47614
TargetGlutathione S-transferase Mu 1(Homo sapiens (Human))
Nmmlsc
Curated by PubChem BioAssay
LigandPNGBDBM47614(MLS000693331 | N-(3-hydroxyphenyl)-4-(2-phenylsulf...)
Affinity DataEC50:  1.90E+3nM. Assay description: University of New Mexico Assay Overview: Assay Support: NIH I RO3 MH081231-01 HTS to identify specific small molecule inhibitors of Ras and Ras-re...
In DepthDetails PCBioAssay