BDBM476181 US10874634, Cmpd No. 03::US11364220, Compound 03
SMILES CN(C(=O)c1ccc2c(c1)C(C)(C)CCC2(C)C)c1ccc(CC(O)=O)cc1
InChI Key InChIKey=DNZOCGPPYZRCCL-UHFFFAOYSA-N
Data  4 IC50
  Tab Delimited (TSV)   2D SDfile   Computed 3D by Vconf -m prep SDfile
Find this compound or compounds like it in BindingDB:
Activity Spreadsheet -- Enzyme Inhibition Constant Data from BindingDB
Found 4 hits for monomerid = 476181
TargetCytochrome P450 26A1(Homo sapiens (Human))
Queens University At Kingston
US Patent
LigandPNGBDBM476181(US10874634, Cmpd No. 03 | US11364220, Compound 03)
Affinity DataIC50: >1.00E+5nM. Assay description: CYP26A1 or CYP26B1 stably transfected HeLa cells were maintained in Minimum Essential Medium (MEM) containing 10% fetal bovine serum (FBS) and 100 &#...
Ligand InfoKEGGPC cidPC sid
In DepthDetails US Patent
TargetCytochrome P450 26B1(Homo sapiens (Human))
Queens University At Kingston
US Patent
LigandPNGBDBM476181(US10874634, Cmpd No. 03 | US11364220, Compound 03)
Affinity DataIC50:  6.54E+4nM. Assay description: This retinoid activity assay measures the ability of test compounds to induce expression of a transiently transfected RA sensitive reporter construct...
Ligand InfoKEGGPC cidPC sid
In DepthDetails US Patent
TargetCytochrome P450 26A1(Homo sapiens (Human))
Queens University At Kingston
US Patent
LigandPNGBDBM476181(US10874634, Cmpd No. 03 | US11364220, Compound 03)
Affinity DataIC50: >1.00E+5nM. Assay description: This retinoid activity assay measures the ability of test compounds to induce expression of a transiently transfected RA sensitive reporter construct...
Ligand InfoKEGGPC cidPC sid
In DepthDetails US Patent
TargetCytochrome P450 26B1(Homo sapiens (Human))
Queens University At Kingston
US Patent
LigandPNGBDBM476181(US10874634, Cmpd No. 03 | US11364220, Compound 03)
Affinity DataIC50:  6.54E+4nM. Assay description: CYP26A1 or CYP26B1 stably transfected HeLa cells were maintained in Minimum Essential Medium (MEM) containing 10% fetal bovine serum (FBS) and 100 &#...
Ligand InfoKEGGPC cidPC sid
In DepthDetails US Patent