BDBM476190 US10865384, Compound IM-40::US10865384, Example 2m
SMILES COC(=O)c1ccc(cc1)-c1nc(c([nH]1)-c1ccncc1)-c1cccc(C)c1
InChI Key InChIKey=AOZJPKIKAFEWHY-UHFFFAOYSA-N
Data  1 IC50
  Tab Delimited (TSV)   2D SDfile   Computed 3D by Vconf -m prep SDfile
Find this compound or compounds like it in BindingDB:
Activity Spreadsheet -- Enzyme Inhibition Constant Data from BindingDB
Found 1 hit for monomerid = 476190
TargetMitogen-activated protein kinase 14(Homo sapiens (Human))
Agency For Science, Technology And Research
US Patent
LigandPNGBDBM476190(US10865384, Compound IM-40 | US10865384, Example 2...)
Affinity DataIC50:  3.70nM. Assay description: Table 2: The p38 MAPK IC50 values of selected compounds except IM-32 to IM-44 were determined using the HitHunter™ p38 MAP kinase binding assay from ...
Ligand InfoPC cidPC sid
In DepthDetails US Patent