BDBM476201 US10865384, Compound IM-20::US10865384, Example 3d
SMILES Fc1ccc(cc1)-c1nc([nH]c1C1=CCOCC1)-c1ccccc1F
InChI Key InChIKey=FLOFFTKXJJNRCP-UHFFFAOYSA-N
Data  5 IC50
  Tab Delimited (TSV)   2D SDfile   Computed 3D by Vconf -m prep SDfile
Find this compound or compounds like it in BindingDB:
Activity Spreadsheet -- Enzyme Inhibition Constant Data from BindingDB
Found 5 hits for monomerid = 476201
TargetMitogen-activated protein kinase 14(Homo sapiens (Human))
Agency For Science, Technology And Research
US Patent
LigandPNGBDBM476201(US10865384, Compound IM-20 | US10865384, Example 3...)
Affinity DataIC50:  561nM. Assay description: Table 2: The p38 MAPK IC50 values of selected compounds except IM-32 to IM-44 were determined using the HitHunter™ p38 MAP kinase binding assay from ...
Ligand InfoPC cidPC sid
In DepthDetails US Patent
TargetCasein kinase I isoform delta(Homo sapiens (Human))
Agency For Science, Technology And Research
US Patent
LigandPNGBDBM476201(US10865384, Compound IM-20 | US10865384, Example 3...)
Affinity DataIC50:  1.52E+3nM. Assay description: Table 2: The p38 MAPK IC50 values of selected compounds except IM-32 to IM-44 were determined using the HitHunter™ p38 MAP kinase binding assay from ...
Ligand InfoPC cidPC sid
In DepthDetails US Patent
TargetCasein kinase I isoform epsilon(Homo sapiens (Human))
Agency For Science, Technology And Research
US Patent
LigandPNGBDBM476201(US10865384, Compound IM-20 | US10865384, Example 3...)
Affinity DataIC50:  1.15E+3nM. Assay description: Table 3: Small molecules were tested for their inhibitory activities towards casein kinase 1 delta (CK1δ) and 1 epsilon (CK1ϵ). The in vit...
Ligand InfoPC cidPC sid
In DepthDetails US Patent
TargetCasein kinase I isoform delta(Homo sapiens (Human))
Agency For Science, Technology And Research
US Patent
LigandPNGBDBM476201(US10865384, Compound IM-20 | US10865384, Example 3...)
Affinity DataIC50:  1.52E+3nM. Assay description: Table 3: Small molecules were tested for their inhibitory activities towards casein kinase 1 delta (CK1δ) and 1 epsilon (CK1ϵ). The in vit...
Ligand InfoPC cidPC sid
In DepthDetails US Patent
TargetCasein kinase I isoform epsilon(Homo sapiens (Human))
Agency For Science, Technology And Research
US Patent
LigandPNGBDBM476201(US10865384, Compound IM-20 | US10865384, Example 3...)
Affinity DataIC50:  1.15E+3nM. Assay description: Table 2: The p38 MAPK IC50 values of selected compounds except IM-32 to IM-44 were determined using the HitHunter™ p38 MAP kinase binding assay from ...
Ligand InfoPC cidPC sid
In DepthDetails US Patent