BDBM476211 US10865384, Compound IM-03::US10865384, Example 4h
SMILES Cc1cccc(c1)-c1nc([nH]c1C1=CCOCC1)-c1ccc2ccccc2c1F
InChI Key InChIKey=UTJFCCIPTBPDSB-UHFFFAOYSA-N
Data  1 IC50
  Tab Delimited (TSV)   2D SDfile   Computed 3D by Vconf -m prep SDfile
Find this compound or compounds like it in BindingDB:
Activity Spreadsheet -- Enzyme Inhibition Constant Data from BindingDB
Found 1 hit for monomerid = 476211
TargetMitogen-activated protein kinase 14(Homo sapiens (Human))
Agency For Science, Technology And Research
US Patent
LigandPNGBDBM476211(US10865384, Compound IM-03 | US10865384, Example 4...)
Affinity DataIC50:  262nM. Assay description: Table 2: The p38 MAPK IC50 values of selected compounds except IM-32 to IM-44 were determined using the HitHunter™ p38 MAP kinase binding assay from ...
Ligand InfoPC cidPC sid
In DepthDetails US Patent