BDBM476218 US10874634, Cmpd No. 04A
SMILES COC(=C)Cc1ccc(NS(=O)(=O)C2=CC3C(C=C2)C(C)(C)CCC3(C)C)cc1
InChI Key InChIKey=ZLOGDWADCUQKSO-UHFFFAOYSA-N
Data  1 IC50
  Tab Delimited (TSV)   2D SDfile   Computed 3D by Vconf -m prep SDfile
Find this compound or compounds like it in BindingDB:
Activity Spreadsheet -- Enzyme Inhibition Constant Data from BindingDB
Found 1 hit for monomerid = 476218
TargetCytochrome P450 26A1(Homo sapiens (Human))
Queens University At Kingston
US Patent
LigandPNGBDBM476218(US10874634, Cmpd No. 04A)
Affinity DataIC50:  1.40E+4nM. Assay description: CYP26A1 or CYP26B1 stably transfected HeLa cells were maintained in Minimum Essential Medium (MEM) containing 10% fetal bovine serum (FBS) and 100 &#...
Ligand InfoPC cidPC sid
In DepthDetails US Patent