BDBM47624 9-(4-methylphenyl)-5-{[3-(4-morpholinyl)propyl]amino}-8H-thieno[2',3':4,5]pyrimido[2,1-a]phthalazin-8-one::MLS000662061::SMR000292709::cid_1587961
SMILES Cc1ccc(cc1)-c1csc2nc3c4ccccc4c(NCCCN4CCOCC4)nn3c(=O)c12
InChI Key InChIKey=XLWKLZJJUBLVLS-UHFFFAOYSA-N
Data  1 EC50
  Tab Delimited (TSV)   2D SDfile   Computed 3D by Vconf -m prep SDfile
Find this compound or compounds like it in BindingDB:
Activity Spreadsheet -- Enzyme Inhibition Constant Data from BindingDB
Found 1 hit for monomerid = 47624
TargetGlutathione S-transferase Mu 1(Homo sapiens (Human))
Nmmlsc
Curated by PubChem BioAssay
LigandPNGBDBM47624(9-(4-methylphenyl)-5-{[3-(4-morpholinyl)propyl]ami...)
Affinity DataEC50:  346nM. Assay description: University of New Mexico Assay Overview: Assay Support: NIH I RO3 MH081231-01 HTS to identify specific small molecule inhibitors of Ras and Ras-re...
In DepthDetails PCBioAssay