BDBM476290 (1aR,6aR)-5-(2-((1-(1H-1,2,3-triazol-4-yl)cyclopropyl)amino)-2-oxoacetyl)-N-(3-chloro-4-fluorophenyl)-4-methyl-1,1a,6,6a-tetrahydrocyclopropa[b]pyrrolizine-3-carboxamide::US10874640, Compound 52
SMILES Cc1c(C(=O)C(=O)NC2(CC2)c2cnn(COCC[Si](C)(C)C)n2)c2C[C@H]3C[C@H]3n2c1C(=O)Nc1ccc(F)c(Cl)c1
InChI Key InChIKey=YXEZRIIYFNMGMY-DYESRHJHSA-N
Data  1 EC50
  Tab Delimited (TSV)   2D SDfile   Computed 3D by Vconf -m prep SDfile
Find this compound or compounds like it in BindingDB:
Activity Spreadsheet -- Enzyme Inhibition Constant Data from BindingDB
Found 1 hit for monomerid = 476290
TargetCapsid protein(Hepatitis B virus genotype C subtype ayr (isolate ...)
Gilead Sciences
US Patent
LigandPNGBDBM476290((1aR,6aR)-5-(2-((1-(1H-1,2,3-triazol-4-yl)cyclopro...)
Affinity DataEC50:  7.70nM. Assay description: A HepG2 cell line overexpressing the HBV virus attachment receptor sodium-taurocholate cotransporting polypeptide (NTCP) was grown to confluency in D...
Ligand InfoPC cidPC sid
In DepthDetails US Patent