BDBM476366 4-(cyanomethyl)-2-methoxyphenyl (3S)-4-(N,3-dicyclohexyl-D-alanyl)-3- [(thiophen-2- ylmethyl)carbamoyl]piperazine-1- carboxylate::US10875851, Example 22
SMILES COc1cc(CC#N)ccc1OC(=O)N1CCN([C@@H](C1)C(=O)NCc1cccs1)C(=O)[C@@H](CC1CCCCC1)NC1CCCCC1
InChI Key InChIKey=FKBXTOWHHZJKMT-IHLOFXLRSA-N
Data  1 IC50
  Tab Delimited (TSV)   2D SDfile   Computed 3D by Vconf -m prep SDfile
Find this compound or compounds like it in BindingDB:
Activity Spreadsheet -- Enzyme Inhibition Constant Data from BindingDB
Found 1 hit for monomerid = 476366
TargetCoagulation factor XII(Homo sapiens (Human))
Merck Sharp & Dohme
US Patent
LigandPNGBDBM476366(4-(cyanomethyl)-2-methoxyphenyl (3S)-4-(N,3-dicycl...)
Affinity DataIC50:  12.9nM. Assay description: The effectiveness of a compound of the present invention as an inhibitor of Coagulation Factor XIIa can be determined using a relevant purified serin...
Ligand InfoPC cidPC sid
In DepthDetails US Patent