BDBM476373 4-methylquinazolin-8-yl (3S)-4-(N,3- dicyclohexyl-D-alanyl)-3-[(thiophen- 2-ylmethyl)carbamoyl]piperazine-1- carboxylate::US10875851, Example 29
SMILES Cc1ncnc2c(OC(=O)N3CCN([C@@H](C3)C(=O)NCc3cccs3)C(=O)[C@@H](CC3CCCCC3)NC3CCCCC3)cccc12
InChI Key InChIKey=XQSXYKWKFNRWJE-IHLOFXLRSA-N
Data  1 IC50
  Tab Delimited (TSV)   2D SDfile   Computed 3D by Vconf -m prep SDfile
Find this compound or compounds like it in BindingDB:
Activity Spreadsheet -- Enzyme Inhibition Constant Data from BindingDB
Found 1 hit for monomerid = 476373
TargetCoagulation factor XII(Homo sapiens (Human))
Merck Sharp & Dohme
US Patent
LigandPNGBDBM476373(4-methylquinazolin-8-yl (3S)-4-(N,3- dicyclohexyl-...)
Affinity DataIC50:  3.30nM. Assay description: The effectiveness of a compound of the present invention as an inhibitor of Coagulation Factor XIIa can be determined using a relevant purified serin...
Ligand InfoPC cidPC sid
In DepthDetails US Patent