BDBM476376 5-fluoroquinolin-8-yl (3S)-4-(N,3- dicyclohexyl-D-alanyl)-3-[(thiophen- 2-ylmethyl)carbamoyl]piperazine-1- carboxylate::US10875851, Example 32
SMILES Fc1ccc(OC(=O)N2CCN([C@@H](C2)C(=O)NCc2cccs2)C(=O)[C@@H](CC2CCCCC2)NC2CCCCC2)c2ncccc12
InChI Key InChIKey=ZCQJMRPYOILSEF-IHLOFXLRSA-N
Data  1 IC50
  Tab Delimited (TSV)   2D SDfile   Computed 3D by Vconf -m prep SDfile
Find this compound or compounds like it in BindingDB:
Activity Spreadsheet -- Enzyme Inhibition Constant Data from BindingDB
Found 1 hit for monomerid = 476376
TargetCoagulation factor XII(Homo sapiens (Human))
Merck Sharp & Dohme
US Patent
LigandPNGBDBM476376(5-fluoroquinolin-8-yl (3S)-4-(N,3- dicyclohexyl-D-...)
Affinity DataIC50:  5.20nM. Assay description: The effectiveness of a compound of the present invention as an inhibitor of Coagulation Factor XIIa can be determined using a relevant purified serin...
Ligand InfoPC cidPC sid
In DepthDetails US Patent