BDBM476419 3-[amino(methoxy)methyl]phenyl (3S)-4-[N2-(2-benzyl-2- azaspiro[4.5]dec-8-yl)-N6- (methylsulfonyl)-D-lysyl]-3- [(thiophen-2- ylmethyl)carbamoyl]piperazine-1- carboxylate::US10875851, Example 75
SMILES COC(N)c1cccc(OC(=O)N2CCN([C@@H](C2)C(=O)NCc2cccs2)C(=O)[C@@H](CCCCNS(C)(=O)=O)NC2CCC3(CCN(Cc4ccccc4)C3)CC2)c1
InChI Key InChIKey=IUHZOGMZOJBFPS-PHYQGNOOSA-N
Data  1 IC50
  Tab Delimited (TSV)   2D SDfile   Computed 3D by Vconf -m prep SDfile
Find this compound or compounds like it in BindingDB:
Activity Spreadsheet -- Enzyme Inhibition Constant Data from BindingDB
Found 1 hit for monomerid = 476419
TargetCoagulation factor XII(Homo sapiens (Human))
Merck Sharp & Dohme
US Patent
LigandPNGBDBM476419(3-[amino(methoxy)methyl]phenyl (3S)-4-[N2-(2-benzy...)
Affinity DataIC50:  5.70nM. Assay description: The effectiveness of a compound of the present invention as an inhibitor of Coagulation Factor XIIa can be determined using a relevant purified serin...
Ligand InfoPC cidPC sid
In DepthDetails US Patent