BDBM476430 3-(aminomethyl)phenyl (3S)-4-[N2-(2- benzyl-2-azaspiro[4.5]dec-8-yl)-N6- (methylsulfonyl)-D-lysyl]-3- [(thiophen-2- ylmethyl)carbamoyl]piperazine-1- carboxylate::US10875851, Example 86
SMILES CS(=O)(=O)NCCCC[C@@H](NC1CCC2(CNC(Cc3ccccc3)C2)CC1)C(=O)N1CCN(C[C@H]1C(=O)NCc1cccs1)C(=O)Oc1cccc(CN)c1
InChI Key InChIKey=HTUVQIUEBYDRLA-YDATVROQSA-N
Data  1 IC50
  Tab Delimited (TSV)   2D SDfile   Computed 3D by Vconf -m prep SDfile
Find this compound or compounds like it in BindingDB:
Activity Spreadsheet -- Enzyme Inhibition Constant Data from BindingDB
Found 1 hit for monomerid = 476430
TargetCoagulation factor XII(Homo sapiens (Human))
Merck Sharp & Dohme
US Patent
LigandPNGBDBM476430(3-(aminomethyl)phenyl (3S)-4-[N2-(2- benzyl-2-azas...)
Affinity DataIC50:  16nM. Assay description: The effectiveness of a compound of the present invention as an inhibitor of Coagulation Factor XIIa can be determined using a relevant purified serin...
Ligand InfoPC cidPC sid
In DepthDetails US Patent