BDBM476441 2-chlorophenyl (3S)-4-(N-cyclohexyl- 6-piperidin-1-yl-D-norleucyl)-3- [(thiophen-2- ylmethyl)carbamoyl]piperazine-1- carboxylate::US10875851, Example 97
SMILES Clc1ccccc1OC(=O)N1CCN([C@@H](C1)C(=O)NCc1cccs1)C(=O)[C@@H](CCCCN1CCCCC1)NC1CCCCC1
InChI Key InChIKey=GWSOFATXHLQPNH-IHLOFXLRSA-N
Data  1 IC50
  Tab Delimited (TSV)   2D SDfile   Computed 3D by Vconf -m prep SDfile
Find this compound or compounds like it in BindingDB:
Activity Spreadsheet -- Enzyme Inhibition Constant Data from BindingDB
Found 1 hit for monomerid = 476441
TargetCoagulation factor XII(Homo sapiens (Human))
Merck Sharp & Dohme
US Patent
LigandPNGBDBM476441(2-chlorophenyl (3S)-4-(N-cyclohexyl- 6-piperidin-1...)
Affinity DataIC50:  0.700nM. Assay description: The effectiveness of a compound of the present invention as an inhibitor of Coagulation Factor XIIa can be determined using a relevant purified serin...
Ligand InfoPC cidPC sid
In DepthDetails US Patent