BDBM476442 2-chloro-3,4-dimethylphenyl (3S)-4- (N6,N6-dimethyl-D-lysyl)-3- [(thiophen-2- ylmethyl)carbamoyl]piperazine-1- carboxylate::US10875851, Example 98
SMILES CN(C)CCCC[C@@H](N)C(=O)N1CCN(C[C@H]1C(=O)NCc1cccs1)C(=O)Oc1ccc(C)c(C)c1Cl
InChI Key InChIKey=FHZSGHIMPQNNEN-YADHBBJMSA-N
Data  1 IC50
  Tab Delimited (TSV)   2D SDfile   Computed 3D by Vconf -m prep SDfile
Find this compound or compounds like it in BindingDB:
Activity Spreadsheet -- Enzyme Inhibition Constant Data from BindingDB
Found 1 hit for monomerid = 476442
TargetCoagulation factor XII(Homo sapiens (Human))
Merck Sharp & Dohme
US Patent
LigandPNGBDBM476442(2-chloro-3,4-dimethylphenyl (3S)-4- (N6,N6-dimethy...)
Affinity DataIC50:  7.20nM. Assay description: The effectiveness of a compound of the present invention as an inhibitor of Coagulation Factor XIIa can be determined using a relevant purified serin...
Ligand InfoPC cidPC sid
In DepthDetails US Patent