BDBM476454 2-chloro-3,4-dimethylphenyl (3S)-4- [N-(2-benzyl-2-azaspiro[4.5]dec-8- yl)-6-(2-methylpyrrolidin-1-yl)-D- norleucyl]-3-[(thiophen-2- ylmethyl)carbamoyl]piperazine-1- carboxylate::US10875851, Example 110
SMILES CC1CCCN1CCCC[C@@H](NC1CCC2(CCN(Cc3ccccc3)C2)CC1)C(=O)N1CCN(C[C@H]1C(=O)NCc1cccs1)C(=O)Oc1ccc(C)c(C)c1Cl
InChI Key InChIKey=JJMMHLSLGAYCNO-IZLAINBBSA-N
Data  1 IC50
  Tab Delimited (TSV)   2D SDfile   Computed 3D by Vconf -m prep SDfile
Find this compound or compounds like it in BindingDB:
Activity Spreadsheet -- Enzyme Inhibition Constant Data from BindingDB
Found 1 hit for monomerid = 476454
TargetCoagulation factor XII(Homo sapiens (Human))
Merck Sharp & Dohme
US Patent
LigandPNGBDBM476454(2-chloro-3,4-dimethylphenyl (3S)-4- [N-(2-benzyl-2...)
Affinity DataIC50:  0.300nM. Assay description: The effectiveness of a compound of the present invention as an inhibitor of Coagulation Factor XIIa can be determined using a relevant purified serin...
Ligand InfoPC cidPC sid
In DepthDetails US Patent