BDBM476457 1-chloronaphthalen-2-yl (3S)-4-[N2- cyclopentyl-N~6~-(methylsulfonyl)- D-lysyl]-3-[(thiophen-2- ylmethyl)carbamoyl]piperazine-1- carboxylate::US10875851, Example 113
SMILES CS(=O)(=O)NCCCC[C@@H](NC1CCCC1)C(=O)N1CCN(C[C@H]1C(=O)NCc1cccs1)C(=O)Oc1ccc2ccccc2c1Cl
InChI Key InChIKey=VHXRJQSFZWKUKL-IZLXSDGUSA-N
Data  1 IC50
  Tab Delimited (TSV)   2D SDfile   Computed 3D by Vconf -m prep SDfile
Find this compound or compounds like it in BindingDB:
Activity Spreadsheet -- Enzyme Inhibition Constant Data from BindingDB
Found 1 hit for monomerid = 476457
TargetCoagulation factor XII(Homo sapiens (Human))
Merck Sharp & Dohme
US Patent
LigandPNGBDBM476457(1-chloronaphthalen-2-yl (3S)-4-[N2- cyclopentyl-N~...)
Affinity DataIC50:  8.40nM. Assay description: The effectiveness of a compound of the present invention as an inhibitor of Coagulation Factor XIIa can be determined using a relevant purified serin...
Ligand InfoPC cidPC sid
In DepthDetails US Patent