BDBM476486 (2S)-1-[N2-(2-benzyl-2- azaspiro[4.5]dec-8-yl)-N6,N6- dimethyl-D-lysyl]-4-[(4S,5S)-4- methyl-5-phenyl-4,5-dihydro-1,3- oxazol-2-yl]-N-(thiophen-2- ylmethyl)piperazine-2-carboxamide::US10875851, Example 142
SMILES C[C@@H]1N=C(O[C@H]1c1ccccc1)N1CCN([C@@H](C1)C(=O)NCc1cccs1)C(=O)[C@@H](CCCCN(C)C)NC1CCC2(CCN(Cc3ccccc3)C2)CC1
InChI Key InChIKey=YLAUIUPHFHFBRG-UAKCHKLZSA-N
Data  1 IC50
  Tab Delimited (TSV)   2D SDfile   Computed 3D by Vconf -m prep SDfile
Find this compound or compounds like it in BindingDB:
Activity Spreadsheet -- Enzyme Inhibition Constant Data from BindingDB
Found 1 hit for monomerid = 476486
TargetCoagulation factor XII(Homo sapiens (Human))
Merck Sharp & Dohme
US Patent
LigandPNGBDBM476486((2S)-1-[N2-(2-benzyl-2- azaspiro[4.5]dec-8-yl)-N6,...)
Affinity DataIC50:  0.400nM. Assay description: The effectiveness of a compound of the present invention as an inhibitor of Coagulation Factor XIIa can be determined using a relevant purified serin...
Ligand InfoPC cidPC sid
In DepthDetails US Patent